CI Run '2026-09-25-03-20-01@8.3dev-zts'
| PHP 8.3dev-zts | Xdebug: 3.6.0alpha1-2-g5e99179a | opcache |
2026-09-25 02:20:17 |
|---|
Build Failure
Configuring for:
PHP Api Version: 20230831
Zend Module Api No: 20230831
Zend Extension Api No: 420230831
checking for grep that handles long lines and -e... /bin/grep
checking for egrep... /bin/grep -E
checking for a sed that does not truncate output... /bin/sed
checking for pkg-config... /bin/pkg-config
checking pkg-config is at least version 0.9.0... yes
checking for cc... cc
checking whether the C compiler works... yes
checking for C compiler default output file name... a.out
checking for suffix of executables...
checking whether we are cross compiling... no
checking for suffix of object files... o
checking whether the compiler supports GNU C... yes
checking whether cc accepts -g... yes
checking for cc option to enable C23 features... none needed
checking how to run the C preprocessor... cc -E
checking for egrep -e... (cached) /bin/grep -E
checking for icc... no
checking for suncc... no
checking for system library directory... lib
checking if compiler supports -Wl,-rpath,... yes
checking build system type... x86_64-pc-linux-gnu
checking host system type... x86_64-pc-linux-gnu
checking target system type... x86_64-pc-linux-gnu
checking for PHP prefix... /tmp/php-build/workspace/install/8.3dev-zts
checking for PHP includes... -I/tmp/php-build/workspace/install/8.3dev-zts/include/php -I/tmp/php-build/workspace/install/8.3dev-zts/include/php/main -I/tmp/php-build/workspace/install/8.3dev-zts/include/php/TSRM -I/tmp/php-build/workspace/install/8.3dev-zts/include/php/Zend -I/tmp/php-build/workspace/install/8.3dev-zts/include/php/ext -I/tmp/php-build/workspace/install/8.3dev-zts/include/php/ext/date/lib
checking for PHP extension directory... /tmp/php-build/workspace/install/8.3dev-zts/lib/php/extensions/debug-zts-20230831
checking for PHP installed headers prefix... /tmp/php-build/workspace/install/8.3dev-zts/include/php
checking if debug is enabled... yes
checking if zts is enabled... yes
checking for gawk... gawk
checking whether to enable Xdebug support... yes, shared
checking whether to enable Xdebug developer build flags... yes
checking whether to compress profiler files (requires zlib)... yes
checking for supported PHP version... supported (8.3.36-dev)
checking for clock_gettime... yes
checking for clock_gettime_nsec_np... no
checking for gettimeofday... yes
checking for stdio.h... yes
checking for stdlib.h... yes
checking for string.h... yes
checking for inttypes.h... yes
checking for stdint.h... yes
checking for strings.h... yes
checking for sys/stat.h... yes
checking for sys/types.h... yes
checking for unistd.h... yes
checking for netinet/in.h... yes
checking for poll.h... yes
checking for sys/poll.h... yes
checking for linux/rtnetlink.h... yes
checking for res_ninit... no
checking for __res_ninit... yes
checking for res_nclose... no
checking for __res_nclose... yes
checking for cos in -lm... yes
checking for zlib >= 1.2.9... yes
checking whether C compiler accepts -Wbool-conversion... no
checking whether C compiler accepts -Wdeclaration-after-statement... yes
checking whether C compiler accepts -Wdiscarded-qualifiers... yes
checking whether C compiler accepts -Wduplicate-enum... no
checking whether C compiler accepts -Wempty-body... yes
checking whether C compiler accepts -Wenum-compare... yes
checking whether C compiler accepts -Werror... yes
checking whether C compiler accepts -Wextra... yes
checking whether C compiler accepts -Wformat-nonliteral... yes
checking whether C compiler accepts -Wformat-security... yes
checking whether C compiler accepts -Wheader-guard... yes
checking whether C compiler accepts -Wincompatible-pointer-types-discards-qualifiers... no
checking whether C compiler accepts -Wimplicit-fallthrough... yes
checking whether C compiler accepts -Winit-self... yes
checking whether C compiler accepts -Wlogical-not-parentheses... yes
checking whether C compiler accepts -Wlogical-op... yes
checking whether C compiler accepts -Wlogical-op-parentheses... no
checking whether C compiler accepts -Wloop-analysis... no
checking whether C compiler accepts -Wmaybe-uninitialized... yes
checking whether C compiler accepts -Wmissing-format-attribute... yes
checking whether C compiler accepts -Wno-missing-field-initializers... yes
checking whether C compiler accepts -Wno-sign-compare... yes
checking whether C compiler accepts -Wno-unused-but-set-variable... yes
checking whether C compiler accepts -Wno-unused-parameter... yes
checking whether C compiler accepts -Wno-variadic-macros... yes
checking whether C compiler accepts -Wparentheses... yes
checking whether C compiler accepts -Wpointer-bool-conversion... no
checking whether C compiler accepts -Wsizeof-array-argument... yes
checking whether C compiler accepts -Wstring-conversion... no
checking whether C compiler accepts -Wwrite-strings... yes
checking whether C compiler accepts -Wpointer-arith... yes
checking whether C compiler accepts -fdiagnostics-show-option... yes
checking whether C compiler accepts -fno-exceptions... yes
checking whether C compiler accepts -fno-omit-frame-pointer... yes
checking whether C compiler accepts -fno-optimize-sibling-calls... yes
checking whether C compiler accepts -fsanitize-address... no
checking whether C compiler accepts -fstack-protector... yes
checking for a sed that does not truncate output... /bin/sed
checking for ld used by cc... /bin/x86_64-linux-gnu-ld
checking if the linker (/bin/x86_64-linux-gnu-ld) is GNU ld... yes
checking for /bin/x86_64-linux-gnu-ld option to reload object files... -r
checking for BSD-compatible nm... /bin/nm -B
checking whether ln -s works... yes
checking how to recognize dependent libraries... pass_all
checking for dlfcn.h... yes
checking the maximum length of command line arguments... 1572864
checking command to parse /bin/nm -B output from cc object... ok
checking for objdir... .libs
checking for ar... ar
checking for ranlib... ranlib
checking for strip... strip
checking if cc supports -fno-rtti -fno-exceptions... no
checking for cc option to produce PIC... -fPIC
checking if cc PIC flag -fPIC works... yes
checking if cc static flag -static works... yes
checking if cc supports -c -o file.o... yes
checking whether the cc linker (/bin/x86_64-linux-gnu-ld -m elf_x86_64) supports shared libraries... yes
checking whether -lc should be explicitly linked in... no
checking dynamic linker characteristics... GNU/Linux ld.so
checking how to hardcode library paths into programs... immediate
checking whether stripping libraries is possible... yes
checking if libtool supports shared libraries... yes
checking whether to build shared libraries... yes
checking whether to build static libraries... no
creating libtool
appending configuration tag "CXX" to libtool
configure: patching config.h.in
configure: creating ./config.status
config.status: creating config.h
Makefile:250: warning: overriding recipe for target 'test'
Makefile:141: warning: ignoring old recipe for target 'test'
find . -name \*.gcno -o -name \*.gcda | xargs rm -f
find . -name \*.lo -o -name \*.o -o -name \*.dep | xargs rm -f
find . -name \*.la -o -name \*.a | xargs rm -f
find . -name \*.so | xargs rm -f
find . -name .libs -a -type d|xargs rm -rf
rm -f libphp.la modules/* libs/*
rm -f ext/opcache/jit/zend_jit_x86.c
rm -f ext/opcache/jit/zend_jit_arm64.c
rm -f ext/opcache/minilua
Makefile:250: warning: overriding recipe for target 'test'
Makefile:141: warning: ignoring old recipe for target 'test'
/bin/bash /tmp/ptester-1001/thread/3/8.3dev-zts/tmp-xdebug/libtool --tag=CC --mode=compile cc -I. -I/tmp/ptester-1001/thread/3/8.3dev-zts/tmp-xdebug -I/tmp/ptester-1001/thread/3/8.3dev-zts/tmp-xdebug/include -I/tmp/ptester-1001/thread/3/8.3dev-zts/tmp-xdebug/main -I/tmp/ptester-1001/thread/3/8.3dev-zts/tmp-xdebug -I/tmp/php-build/workspace/install/8.3dev-zts/include/php -I/tmp/php-build/workspace/install/8.3dev-zts/include/php/main -I/tmp/php-build/workspace/install/8.3dev-zts/include/php/TSRM -I/tmp/php-build/workspace/install/8.3dev-zts/include/php/Zend -I/tmp/php-build/workspace/install/8.3dev-zts/include/php/ext -I/tmp/php-build/workspace/install/8.3dev-zts/include/php/ext/date/lib -I/tmp/ptester-1001/thread/3/8.3dev-zts/tmp-xdebug/src -DHAVE_CONFIG_H -g -O0 -D_GNU_SOURCE -g -O0 -Wall -Wdeclaration-after-statement -Wdiscarded-qualifiers -Wempty-body -Wenum-compare -Werror -Wextra -Wformat-nonliteral -Wformat-security -Wheader-guard -Wimplicit-fallthrough -Winit-self -Wlogical-not-parentheses -Wlogical-op -Wmaybe-uninitialized -Wmissing-format-attribute -Wno-missing-field-initializers -Wno-sign-compare -Wno-unused-but-set-variable -Wno-unused-parameter -Wno-variadic-macros -Wparentheses -Wsizeof-array-argument -Wwrite-strings -Wpointer-arith -fdiagnostics-show-option -fno-exceptions -fno-omit-frame-pointer -fno-optimize-sibling-calls -fstack-protector -DZEND_COMPILE_DL_EXT=1 -c /tmp/ptester-1001/thread/3/8.3dev-zts/tmp-xdebug/xdebug.c -o xdebug.lo -MMD -MF xdebug.dep -MT xdebug.lo
/bin/bash /tmp/ptester-1001/thread/3/8.3dev-zts/tmp-xdebug/libtool --tag=CC --mode=compile cc -I. -I/tmp/ptester-1001/thread/3/8.3dev-zts/tmp-xdebug -I/tmp/ptester-1001/thread/3/8.3dev-zts/tmp-xdebug/include -I/tmp/ptester-1001/thread/3/8.3dev-zts/tmp-xdebug/main -I/tmp/ptester-1001/thread/3/8.3dev-zts/tmp-xdebug -I/tmp/php-build/workspace/install/8.3dev-zts/include/php -I/tmp/php-build/workspace/install/8.3dev-zts/include/php/main -I/tmp/php-build/workspace/install/8.3dev-zts/include/php/TSRM -I/tmp/php-build/workspace/install/8.3dev-zts/include/php/Zend -I/tmp/php-build/workspace/install/8.3dev-zts/include/php/ext -I/tmp/php-build/workspace/install/8.3dev-zts/include/php/ext/date/lib -I/tmp/ptester-1001/thread/3/8.3dev-zts/tmp-xdebug/src -DHAVE_CONFIG_H -g -O0 -D_GNU_SOURCE -g -O0 -Wall -Wdeclaration-after-statement -Wdiscarded-qualifiers -Wempty-body -Wenum-compare -Werror -Wextra -Wformat-nonliteral -Wformat-security -Wheader-guard -Wimplicit-fallthrough -Winit-self -Wlogical-not-parentheses -Wlogical-op -Wmaybe-uninitialized -Wmissing-format-attribute -Wno-missing-field-initializers -Wno-sign-compare -Wno-unused-but-set-variable -Wno-unused-parameter -Wno-variadic-macros -Wparentheses -Wsizeof-array-argument -Wwrite-strings -Wpointer-arith -fdiagnostics-show-option -fno-exceptions -fno-omit-frame-pointer -fno-optimize-sibling-calls -fstack-protector -DZEND_COMPILE_DL_EXT=1 -c /tmp/ptester-1001/thread/3/8.3dev-zts/tmp-xdebug/src/base/base.c -o src/base/base.lo -MMD -MF src/base/base.dep -MT src/base/base.lo
/bin/bash /tmp/ptester-1001/thread/3/8.3dev-zts/tmp-xdebug/libtool --tag=CC --mode=compile cc -I. -I/tmp/ptester-1001/thread/3/8.3dev-zts/tmp-xdebug -I/tmp/ptester-1001/thread/3/8.3dev-zts/tmp-xdebug/include -I/tmp/ptester-1001/thread/3/8.3dev-zts/tmp-xdebug/main -I/tmp/ptester-1001/thread/3/8.3dev-zts/tmp-xdebug -I/tmp/php-build/workspace/install/8.3dev-zts/include/php -I/tmp/php-build/workspace/install/8.3dev-zts/include/php/main -I/tmp/php-build/workspace/install/8.3dev-zts/include/php/TSRM -I/tmp/php-build/workspace/install/8.3dev-zts/include/php/Zend -I/tmp/php-build/workspace/install/8.3dev-zts/include/php/ext -I/tmp/php-build/workspace/install/8.3dev-zts/include/php/ext/date/lib -I/tmp/ptester-1001/thread/3/8.3dev-zts/tmp-xdebug/src -DHAVE_CONFIG_H -g -O0 -D_GNU_SOURCE -g -O0 -Wall -Wdeclaration-after-statement -Wdiscarded-qualifiers -Wempty-body -Wenum-compare -Werror -Wextra -Wformat-nonliteral -Wformat-security -Wheader-guard -Wimplicit-fallthrough -Winit-self -Wlogical-not-parentheses -Wlogical-op -Wmaybe-uninitialized -Wmissing-format-attribute -Wno-missing-field-initializers -Wno-sign-compare -Wno-unused-but-set-variable -Wno-unused-parameter -Wno-variadic-macros -Wparentheses -Wsizeof-array-argument -Wwrite-strings -Wpointer-arith -fdiagnostics-show-option -fno-exceptions -fno-omit-frame-pointer -fno-optimize-sibling-calls -fstack-protector -DZEND_COMPILE_DL_EXT=1 -c /tmp/ptester-1001/thread/3/8.3dev-zts/tmp-xdebug/src/base/ctrl_socket.c -o src/base/ctrl_socket.lo -MMD -MF src/base/ctrl_socket.dep -MT src/base/ctrl_socket.lo
/bin/bash /tmp/ptester-1001/thread/3/8.3dev-zts/tmp-xdebug/libtool --tag=CC --mode=compile cc -I. -I/tmp/ptester-1001/thread/3/8.3dev-zts/tmp-xdebug -I/tmp/ptester-1001/thread/3/8.3dev-zts/tmp-xdebug/include -I/tmp/ptester-1001/thread/3/8.3dev-zts/tmp-xdebug/main -I/tmp/ptester-1001/thread/3/8.3dev-zts/tmp-xdebug -I/tmp/php-build/workspace/install/8.3dev-zts/include/php -I/tmp/php-build/workspace/install/8.3dev-zts/include/php/main -I/tmp/php-build/workspace/install/8.3dev-zts/include/php/TSRM -I/tmp/php-build/workspace/install/8.3dev-zts/include/php/Zend -I/tmp/php-build/workspace/install/8.3dev-zts/include/php/ext -I/tmp/php-build/workspace/install/8.3dev-zts/include/php/ext/date/lib -I/tmp/ptester-1001/thread/3/8.3dev-zts/tmp-xdebug/src -DHAVE_CONFIG_H -g -O0 -D_GNU_SOURCE -g -O0 -Wall -Wdeclaration-after-statement -Wdiscarded-qualifiers -Wempty-body -Wenum-compare -Werror -Wextra -Wformat-nonliteral -Wformat-security -Wheader-guard -Wimplicit-fallthrough -Winit-self -Wlogical-not-parentheses -Wlogical-op -Wmaybe-uninitialized -Wmissing-format-attribute -Wno-missing-field-initializers -Wno-sign-compare -Wno-unused-but-set-variable -Wno-unused-parameter -Wno-variadic-macros -Wparentheses -Wsizeof-array-argument -Wwrite-strings -Wpointer-arith -fdiagnostics-show-option -fno-exceptions -fno-omit-frame-pointer -fno-optimize-sibling-calls -fstack-protector -DZEND_COMPILE_DL_EXT=1 -c /tmp/ptester-1001/thread/3/8.3dev-zts/tmp-xdebug/src/base/filter.c -o src/base/filter.lo -MMD -MF src/base/filter.dep -MT src/base/filter.lo
/bin/bash /tmp/ptester-1001/thread/3/8.3dev-zts/tmp-xdebug/libtool --tag=CC --mode=compile cc -I. -I/tmp/ptester-1001/thread/3/8.3dev-zts/tmp-xdebug -I/tmp/ptester-1001/thread/3/8.3dev-zts/tmp-xdebug/include -I/tmp/ptester-1001/thread/3/8.3dev-zts/tmp-xdebug/main -I/tmp/ptester-1001/thread/3/8.3dev-zts/tmp-xdebug -I/tmp/php-build/workspace/install/8.3dev-zts/include/php -I/tmp/php-build/workspace/install/8.3dev-zts/include/php/main -I/tmp/php-build/workspace/install/8.3dev-zts/include/php/TSRM -I/tmp/php-build/workspace/install/8.3dev-zts/include/php/Zend -I/tmp/php-build/workspace/install/8.3dev-zts/include/php/ext -I/tmp/php-build/workspace/install/8.3dev-zts/include/php/ext/date/lib -I/tmp/ptester-1001/thread/3/8.3dev-zts/tmp-xdebug/src -DHAVE_CONFIG_H -g -O0 -D_GNU_SOURCE -g -O0 -Wall -Wdeclaration-after-statement -Wdiscarded-qualifiers -Wempty-body -Wenum-compare -Werror -Wextra -Wformat-nonliteral -Wformat-security -Wheader-guard -Wimplicit-fallthrough -Winit-self -Wlogical-not-parentheses -Wlogical-op -Wmaybe-uninitialized -Wmissing-format-attribute -Wno-missing-field-initializers -Wno-sign-compare -Wno-unused-but-set-variable -Wno-unused-parameter -Wno-variadic-macros -Wparentheses -Wsizeof-array-argument -Wwrite-strings -Wpointer-arith -fdiagnostics-show-option -fno-exceptions -fno-omit-frame-pointer -fno-optimize-sibling-calls -fstack-protector -DZEND_COMPILE_DL_EXT=1 -c /tmp/ptester-1001/thread/3/8.3dev-zts/tmp-xdebug/src/lib/usefulstuff.c -o src/lib/usefulstuff.lo -MMD -MF src/lib/usefulstuff.dep -MT src/lib/usefulstuff.lo
/bin/bash /tmp/ptester-1001/thread/3/8.3dev-zts/tmp-xdebug/libtool --tag=CC --mode=compile cc -I. -I/tmp/ptester-1001/thread/3/8.3dev-zts/tmp-xdebug -I/tmp/ptester-1001/thread/3/8.3dev-zts/tmp-xdebug/include -I/tmp/ptester-1001/thread/3/8.3dev-zts/tmp-xdebug/main -I/tmp/ptester-1001/thread/3/8.3dev-zts/tmp-xdebug -I/tmp/php-build/workspace/install/8.3dev-zts/include/php -I/tmp/php-build/workspace/install/8.3dev-zts/include/php/main -I/tmp/php-build/workspace/install/8.3dev-zts/include/php/TSRM -I/tmp/php-build/workspace/install/8.3dev-zts/include/php/Zend -I/tmp/php-build/workspace/install/8.3dev-zts/include/php/ext -I/tmp/php-build/workspace/install/8.3dev-zts/include/php/ext/date/lib -I/tmp/ptester-1001/thread/3/8.3dev-zts/tmp-xdebug/src -DHAVE_CONFIG_H -g -O0 -D_GNU_SOURCE -g -O0 -Wall -Wdeclaration-after-statement -Wdiscarded-qualifiers -Wempty-body -Wenum-compare -Werror -Wextra -Wformat-nonliteral -Wformat-security -Wheader-guard -Wimplicit-fallthrough -Winit-self -Wlogical-not-parentheses -Wlogical-op -Wmaybe-uninitialized -Wmissing-format-attribute -Wno-missing-field-initializers -Wno-sign-compare -Wno-unused-but-set-variable -Wno-unused-parameter -Wno-variadic-macros -Wparentheses -Wsizeof-array-argument -Wwrite-strings -Wpointer-arith -fdiagnostics-show-option -fno-exceptions -fno-omit-frame-pointer -fno-optimize-sibling-calls -fstack-protector -DZEND_COMPILE_DL_EXT=1 -c /tmp/ptester-1001/thread/3/8.3dev-zts/tmp-xdebug/src/lib/arg.c -o src/lib/arg.lo -MMD -MF src/lib/arg.dep -MT src/lib/arg.lo
/bin/bash /tmp/ptester-1001/thread/3/8.3dev-zts/tmp-xdebug/libtool --tag=CC --mode=compile cc -I. -I/tmp/ptester-1001/thread/3/8.3dev-zts/tmp-xdebug -I/tmp/ptester-1001/thread/3/8.3dev-zts/tmp-xdebug/include -I/tmp/ptester-1001/thread/3/8.3dev-zts/tmp-xdebug/main -I/tmp/ptester-1001/thread/3/8.3dev-zts/tmp-xdebug -I/tmp/php-build/workspace/install/8.3dev-zts/include/php -I/tmp/php-build/workspace/install/8.3dev-zts/include/php/main -I/tmp/php-build/workspace/install/8.3dev-zts/include/php/TSRM -I/tmp/php-build/workspace/install/8.3dev-zts/include/php/Zend -I/tmp/php-build/workspace/install/8.3dev-zts/include/php/ext -I/tmp/php-build/workspace/install/8.3dev-zts/include/php/ext/date/lib -I/tmp/ptester-1001/thread/3/8.3dev-zts/tmp-xdebug/src -DHAVE_CONFIG_H -g -O0 -D_GNU_SOURCE -g -O0 -Wall -Wdeclaration-after-statement -Wdiscarded-qualifiers -Wempty-body -Wenum-compare -Werror -Wextra -Wformat-nonliteral -Wformat-security -Wheader-guard -Wimplicit-fallthrough -Winit-self -Wlogical-not-parentheses -Wlogical-op -Wmaybe-uninitialized -Wmissing-format-attribute -Wno-missing-field-initializers -Wno-sign-compare -Wno-unused-but-set-variable -Wno-unused-parameter -Wno-variadic-macros -Wparentheses -Wsizeof-array-argument -Wwrite-strings -Wpointer-arith -fdiagnostics-show-option -fno-exceptions -fno-omit-frame-pointer -fno-optimize-sibling-calls -fstack-protector -DZEND_COMPILE_DL_EXT=1 -c /tmp/ptester-1001/thread/3/8.3dev-zts/tmp-xdebug/src/lib/cmd_parser.c -o src/lib/cmd_parser.lo -MMD -MF src/lib/cmd_parser.dep -MT src/lib/cmd_parser.lo
/bin/bash /tmp/ptester-1001/thread/3/8.3dev-zts/tmp-xdebug/libtool --tag=CC --mode=compile cc -I. -I/tmp/ptester-1001/thread/3/8.3dev-zts/tmp-xdebug -I/tmp/ptester-1001/thread/3/8.3dev-zts/tmp-xdebug/include -I/tmp/ptester-1001/thread/3/8.3dev-zts/tmp-xdebug/main -I/tmp/ptester-1001/thread/3/8.3dev-zts/tmp-xdebug -I/tmp/php-build/workspace/install/8.3dev-zts/include/php -I/tmp/php-build/workspace/install/8.3dev-zts/include/php/main -I/tmp/php-build/workspace/install/8.3dev-zts/include/php/TSRM -I/tmp/php-build/workspace/install/8.3dev-zts/include/php/Zend -I/tmp/php-build/workspace/install/8.3dev-zts/include/php/ext -I/tmp/php-build/workspace/install/8.3dev-zts/include/php/ext/date/lib -I/tmp/ptester-1001/thread/3/8.3dev-zts/tmp-xdebug/src -DHAVE_CONFIG_H -g -O0 -D_GNU_SOURCE -g -O0 -Wall -Wdeclaration-after-statement -Wdiscarded-qualifiers -Wempty-body -Wenum-compare -Werror -Wextra -Wformat-nonliteral -Wformat-security -Wheader-guard -Wimplicit-fallthrough -Winit-self -Wlogical-not-parentheses -Wlogical-op -Wmaybe-uninitialized -Wmissing-format-attribute -Wno-missing-field-initializers -Wno-sign-compare -Wno-unused-but-set-variable -Wno-unused-parameter -Wno-variadic-macros -Wparentheses -Wsizeof-array-argument -Wwrite-strings -Wpointer-arith -fdiagnostics-show-option -fno-exceptions -fno-omit-frame-pointer -fno-optimize-sibling-calls -fstack-protector -DZEND_COMPILE_DL_EXT=1 -c /tmp/ptester-1001/thread/3/8.3dev-zts/tmp-xdebug/src/lib/compat.c -o src/lib/compat.lo -MMD -MF src/lib/compat.dep -MT src/lib/compat.lo
/bin/bash /tmp/ptester-1001/thread/3/8.3dev-zts/tmp-xdebug/libtool --tag=CC --mode=compile cc -I. -I/tmp/ptester-1001/thread/3/8.3dev-zts/tmp-xdebug -I/tmp/ptester-1001/thread/3/8.3dev-zts/tmp-xdebug/include -I/tmp/ptester-1001/thread/3/8.3dev-zts/tmp-xdebug/main -I/tmp/ptester-1001/thread/3/8.3dev-zts/tmp-xdebug -I/tmp/php-build/workspace/install/8.3dev-zts/include/php -I/tmp/php-build/workspace/install/8.3dev-zts/include/php/main -I/tmp/php-build/workspace/install/8.3dev-zts/include/php/TSRM -I/tmp/php-build/workspace/install/8.3dev-zts/include/php/Zend -I/tmp/php-build/workspace/install/8.3dev-zts/include/php/ext -I/tmp/php-build/workspace/install/8.3dev-zts/include/php/ext/date/lib -I/tmp/ptester-1001/thread/3/8.3dev-zts/tmp-xdebug/src -DHAVE_CONFIG_H -g -O0 -D_GNU_SOURCE -g -O0 -Wall -Wdeclaration-after-statement -Wdiscarded-qualifiers -Wempty-body -Wenum-compare -Werror -Wextra -Wformat-nonliteral -Wformat-security -Wheader-guard -Wimplicit-fallthrough -Winit-self -Wlogical-not-parentheses -Wlogical-op -Wmaybe-uninitialized -Wmissing-format-attribute -Wno-missing-field-initializers -Wno-sign-compare -Wno-unused-but-set-variable -Wno-unused-parameter -Wno-variadic-macros -Wparentheses -Wsizeof-array-argument -Wwrite-strings -Wpointer-arith -fdiagnostics-show-option -fno-exceptions -fno-omit-frame-pointer -fno-optimize-sibling-calls -fstack-protector -DZEND_COMPILE_DL_EXT=1 -c /tmp/ptester-1001/thread/3/8.3dev-zts/tmp-xdebug/src/lib/crc32.c -o src/lib/crc32.lo -MMD -MF src/lib/crc32.dep -MT src/lib/crc32.lo
/bin/bash /tmp/ptester-1001/thread/3/8.3dev-zts/tmp-xdebug/libtool --tag=CC --mode=compile cc -I. -I/tmp/ptester-1001/thread/3/8.3dev-zts/tmp-xdebug -I/tmp/ptester-1001/thread/3/8.3dev-zts/tmp-xdebug/include -I/tmp/ptester-1001/thread/3/8.3dev-zts/tmp-xdebug/main -I/tmp/ptester-1001/thread/3/8.3dev-zts/tmp-xdebug -I/tmp/php-build/workspace/install/8.3dev-zts/include/php -I/tmp/php-build/workspace/install/8.3dev-zts/include/php/main -I/tmp/php-build/workspace/install/8.3dev-zts/include/php/TSRM -I/tmp/php-build/workspace/install/8.3dev-zts/include/php/Zend -I/tmp/php-build/workspace/install/8.3dev-zts/include/php/ext -I/tmp/php-build/workspace/install/8.3dev-zts/include/php/ext/date/lib -I/tmp/ptester-1001/thread/3/8.3dev-zts/tmp-xdebug/src -DHAVE_CONFIG_H -g -O0 -D_GNU_SOURCE -g -O0 -Wall -Wdeclaration-after-statement -Wdiscarded-qualifiers -Wempty-body -Wenum-compare -Werror -Wextra -Wformat-nonliteral -Wformat-security -Wheader-guard -Wimplicit-fallthrough -Winit-self -Wlogical-not-parentheses -Wlogical-op -Wmaybe-uninitialized -Wmissing-format-attribute -Wno-missing-field-initializers -Wno-sign-compare -Wno-unused-but-set-variable -Wno-unused-parameter -Wno-variadic-macros -Wparentheses -Wsizeof-array-argument -Wwrite-strings -Wpointer-arith -fdiagnostics-show-option -fno-exceptions -fno-omit-frame-pointer -fno-optimize-sibling-calls -fstack-protector -DZEND_COMPILE_DL_EXT=1 -c /tmp/ptester-1001/thread/3/8.3dev-zts/tmp-xdebug/src/lib/file.c -o src/lib/file.lo -MMD -MF src/lib/file.dep -MT src/lib/file.lo
/bin/bash /tmp/ptester-1001/thread/3/8.3dev-zts/tmp-xdebug/libtool --tag=CC --mode=compile cc -I. -I/tmp/ptester-1001/thread/3/8.3dev-zts/tmp-xdebug -I/tmp/ptester-1001/thread/3/8.3dev-zts/tmp-xdebug/include -I/tmp/ptester-1001/thread/3/8.3dev-zts/tmp-xdebug/main -I/tmp/ptester-1001/thread/3/8.3dev-zts/tmp-xdebug -I/tmp/php-build/workspace/install/8.3dev-zts/include/php -I/tmp/php-build/workspace/install/8.3dev-zts/include/php/main -I/tmp/php-build/workspace/install/8.3dev-zts/include/php/TSRM -I/tmp/php-build/workspace/install/8.3dev-zts/include/php/Zend -I/tmp/php-build/workspace/install/8.3dev-zts/include/php/ext -I/tmp/php-build/workspace/install/8.3dev-zts/include/php/ext/date/lib -I/tmp/ptester-1001/thread/3/8.3dev-zts/tmp-xdebug/src -DHAVE_CONFIG_H -g -O0 -D_GNU_SOURCE -g -O0 -Wall -Wdeclaration-after-statement -Wdiscarded-qualifiers -Wempty-body -Wenum-compare -Werror -Wextra -Wformat-nonliteral -Wformat-security -Wheader-guard -Wimplicit-fallthrough -Winit-self -Wlogical-not-parentheses -Wlogical-op -Wmaybe-uninitialized -Wmissing-format-attribute -Wno-missing-field-initializers -Wno-sign-compare -Wno-unused-but-set-variable -Wno-unused-parameter -Wno-variadic-macros -Wparentheses -Wsizeof-array-argument -Wwrite-strings -Wpointer-arith -fdiagnostics-show-option -fno-exceptions -fno-omit-frame-pointer -fno-optimize-sibling-calls -fstack-protector -DZEND_COMPILE_DL_EXT=1 -c /tmp/ptester-1001/thread/3/8.3dev-zts/tmp-xdebug/src/lib/hash.c -o src/lib/hash.lo -MMD -MF src/lib/hash.dep -MT src/lib/hash.lo
/bin/bash /tmp/ptester-1001/thread/3/8.3dev-zts/tmp-xdebug/libtool --tag=CC --mode=compile cc -I. -I/tmp/ptester-1001/thread/3/8.3dev-zts/tmp-xdebug -I/tmp/ptester-1001/thread/3/8.3dev-zts/tmp-xdebug/include -I/tmp/ptester-1001/thread/3/8.3dev-zts/tmp-xdebug/main -I/tmp/ptester-1001/thread/3/8.3dev-zts/tmp-xdebug -I/tmp/php-build/workspace/install/8.3dev-zts/include/php -I/tmp/php-build/workspace/install/8.3dev-zts/include/php/main -I/tmp/php-build/workspace/install/8.3dev-zts/include/php/TSRM -I/tmp/php-build/workspace/install/8.3dev-zts/include/php/Zend -I/tmp/php-build/workspace/install/8.3dev-zts/include/php/ext -I/tmp/php-build/workspace/install/8.3dev-zts/include/php/ext/date/lib -I/tmp/ptester-1001/thread/3/8.3dev-zts/tmp-xdebug/src -DHAVE_CONFIG_H -g -O0 -D_GNU_SOURCE -g -O0 -Wall -Wdeclaration-after-statement -Wdiscarded-qualifiers -Wempty-body -Wenum-compare -Werror -Wextra -Wformat-nonliteral -Wformat-security -Wheader-guard -Wimplicit-fallthrough -Winit-self -Wlogical-not-parentheses -Wlogical-op -Wmaybe-uninitialized -Wmissing-format-attribute -Wno-missing-field-initializers -Wno-sign-compare -Wno-unused-but-set-variable -Wno-unused-parameter -Wno-variadic-macros -Wparentheses -Wsizeof-array-argument -Wwrite-strings -Wpointer-arith -fdiagnostics-show-option -fno-exceptions -fno-omit-frame-pointer -fno-optimize-sibling-calls -fstack-protector -DZEND_COMPILE_DL_EXT=1 -c /tmp/ptester-1001/thread/3/8.3dev-zts/tmp-xdebug/src/lib/headers.c -o src/lib/headers.lo -MMD -MF src/lib/headers.dep -MT src/lib/headers.lo
/bin/bash /tmp/ptester-1001/thread/3/8.3dev-zts/tmp-xdebug/libtool --tag=CC --mode=compile cc -I. -I/tmp/ptester-1001/thread/3/8.3dev-zts/tmp-xdebug -I/tmp/ptester-1001/thread/3/8.3dev-zts/tmp-xdebug/include -I/tmp/ptester-1001/thread/3/8.3dev-zts/tmp-xdebug/main -I/tmp/ptester-1001/thread/3/8.3dev-zts/tmp-xdebug -I/tmp/php-build/workspace/install/8.3dev-zts/include/php -I/tmp/php-build/workspace/install/8.3dev-zts/include/php/main -I/tmp/php-build/workspace/install/8.3dev-zts/include/php/TSRM -I/tmp/php-build/workspace/install/8.3dev-zts/include/php/Zend -I/tmp/php-build/workspace/install/8.3dev-zts/include/php/ext -I/tmp/php-build/workspace/install/8.3dev-zts/include/php/ext/date/lib -I/tmp/ptester-1001/thread/3/8.3dev-zts/tmp-xdebug/src -DHAVE_CONFIG_H -g -O0 -D_GNU_SOURCE -g -O0 -Wall -Wdeclaration-after-statement -Wdiscarded-qualifiers -Wempty-body -Wenum-compare -Werror -Wextra -Wformat-nonliteral -Wformat-security -Wheader-guard -Wimplicit-fallthrough -Winit-self -Wlogical-not-parentheses -Wlogical-op -Wmaybe-uninitialized -Wmissing-format-attribute -Wno-missing-field-initializers -Wno-sign-compare -Wno-unused-but-set-variable -Wno-unused-parameter -Wno-variadic-macros -Wparentheses -Wsizeof-array-argument -Wwrite-strings -Wpointer-arith -fdiagnostics-show-option -fno-exceptions -fno-omit-frame-pointer -fno-optimize-sibling-calls -fstack-protector -DZEND_COMPILE_DL_EXT=1 -c /tmp/ptester-1001/thread/3/8.3dev-zts/tmp-xdebug/src/lib/lib.c -o src/lib/lib.lo -MMD -MF src/lib/lib.dep -MT src/lib/lib.lo
/bin/bash /tmp/ptester-1001/thread/3/8.3dev-zts/tmp-xdebug/libtool --tag=CC --mode=compile cc -I. -I/tmp/ptester-1001/thread/3/8.3dev-zts/tmp-xdebug -I/tmp/ptester-1001/thread/3/8.3dev-zts/tmp-xdebug/include -I/tmp/ptester-1001/thread/3/8.3dev-zts/tmp-xdebug/main -I/tmp/ptester-1001/thread/3/8.3dev-zts/tmp-xdebug -I/tmp/php-build/workspace/install/8.3dev-zts/include/php -I/tmp/php-build/workspace/install/8.3dev-zts/include/php/main -I/tmp/php-build/workspace/install/8.3dev-zts/include/php/TSRM -I/tmp/php-build/workspace/install/8.3dev-zts/include/php/Zend -I/tmp/php-build/workspace/install/8.3dev-zts/include/php/ext -I/tmp/php-build/workspace/install/8.3dev-zts/include/php/ext/date/lib -I/tmp/ptester-1001/thread/3/8.3dev-zts/tmp-xdebug/src -DHAVE_CONFIG_H -g -O0 -D_GNU_SOURCE -g -O0 -Wall -Wdeclaration-after-statement -Wdiscarded-qualifiers -Wempty-body -Wenum-compare -Werror -Wextra -Wformat-nonliteral -Wformat-security -Wheader-guard -Wimplicit-fallthrough -Winit-self -Wlogical-not-parentheses -Wlogical-op -Wmaybe-uninitialized -Wmissing-format-attribute -Wno-missing-field-initializers -Wno-sign-compare -Wno-unused-but-set-variable -Wno-unused-parameter -Wno-variadic-macros -Wparentheses -Wsizeof-array-argument -Wwrite-strings -Wpointer-arith -fdiagnostics-show-option -fno-exceptions -fno-omit-frame-pointer -fno-optimize-sibling-calls -fstack-protector -DZEND_COMPILE_DL_EXT=1 -c /tmp/ptester-1001/thread/3/8.3dev-zts/tmp-xdebug/src/lib/llist.c -o src/lib/llist.lo -MMD -MF src/lib/llist.dep -MT src/lib/llist.lo
/bin/bash /tmp/ptester-1001/thread/3/8.3dev-zts/tmp-xdebug/libtool --tag=CC --mode=compile cc -I. -I/tmp/ptester-1001/thread/3/8.3dev-zts/tmp-xdebug -I/tmp/ptester-1001/thread/3/8.3dev-zts/tmp-xdebug/include -I/tmp/ptester-1001/thread/3/8.3dev-zts/tmp-xdebug/main -I/tmp/ptester-1001/thread/3/8.3dev-zts/tmp-xdebug -I/tmp/php-build/workspace/install/8.3dev-zts/include/php -I/tmp/php-build/workspace/install/8.3dev-zts/include/php/main -I/tmp/php-build/workspace/install/8.3dev-zts/include/php/TSRM -I/tmp/php-build/workspace/install/8.3dev-zts/include/php/Zend -I/tmp/php-build/workspace/install/8.3dev-zts/include/php/ext -I/tmp/php-build/workspace/install/8.3dev-zts/include/php/ext/date/lib -I/tmp/ptester-1001/thread/3/8.3dev-zts/tmp-xdebug/src -DHAVE_CONFIG_H -g -O0 -D_GNU_SOURCE -g -O0 -Wall -Wdeclaration-after-statement -Wdiscarded-qualifiers -Wempty-body -Wenum-compare -Werror -Wextra -Wformat-nonliteral -Wformat-security -Wheader-guard -Wimplicit-fallthrough -Winit-self -Wlogical-not-parentheses -Wlogical-op -Wmaybe-uninitialized -Wmissing-format-attribute -Wno-missing-field-initializers -Wno-sign-compare -Wno-unused-but-set-variable -Wno-unused-parameter -Wno-variadic-macros -Wparentheses -Wsizeof-array-argument -Wwrite-strings -Wpointer-arith -fdiagnostics-show-option -fno-exceptions -fno-omit-frame-pointer -fno-optimize-sibling-calls -fstack-protector -DZEND_COMPILE_DL_EXT=1 -c /tmp/ptester-1001/thread/3/8.3dev-zts/tmp-xdebug/src/lib/log.c -o src/lib/log.lo -MMD -MF src/lib/log.dep -MT src/lib/log.lo
/bin/bash /tmp/ptester-1001/thread/3/8.3dev-zts/tmp-xdebug/libtool --tag=CC --mode=compile cc -I. -I/tmp/ptester-1001/thread/3/8.3dev-zts/tmp-xdebug -I/tmp/ptester-1001/thread/3/8.3dev-zts/tmp-xdebug/include -I/tmp/ptester-1001/thread/3/8.3dev-zts/tmp-xdebug/main -I/tmp/ptester-1001/thread/3/8.3dev-zts/tmp-xdebug -I/tmp/php-build/workspace/install/8.3dev-zts/include/php -I/tmp/php-build/workspace/install/8.3dev-zts/include/php/main -I/tmp/php-build/workspace/install/8.3dev-zts/include/php/TSRM -I/tmp/php-build/workspace/install/8.3dev-zts/include/php/Zend -I/tmp/php-build/workspace/install/8.3dev-zts/include/php/ext -I/tmp/php-build/workspace/install/8.3dev-zts/include/php/ext/date/lib -I/tmp/ptester-1001/thread/3/8.3dev-zts/tmp-xdebug/src -DHAVE_CONFIG_H -g -O0 -D_GNU_SOURCE -g -O0 -Wall -Wdeclaration-after-statement -Wdiscarded-qualifiers -Wempty-body -Wenum-compare -Werror -Wextra -Wformat-nonliteral -Wformat-security -Wheader-guard -Wimplicit-fallthrough -Winit-self -Wlogical-not-parentheses -Wlogical-op -Wmaybe-uninitialized -Wmissing-format-attribute -Wno-missing-field-initializers -Wno-sign-compare -Wno-unused-but-set-variable -Wno-unused-parameter -Wno-variadic-macros -Wparentheses -Wsizeof-array-argument -Wwrite-strings -Wpointer-arith -fdiagnostics-show-option -fno-exceptions -fno-omit-frame-pointer -fno-optimize-sibling-calls -fstack-protector -DZEND_COMPILE_DL_EXT=1 -c /tmp/ptester-1001/thread/3/8.3dev-zts/tmp-xdebug/src/lib/normalize_path.c -o src/lib/normalize_path.lo -MMD -MF src/lib/normalize_path.dep -MT src/lib/normalize_path.lo
/bin/bash /tmp/ptester-1001/thread/3/8.3dev-zts/tmp-xdebug/libtool --tag=CC --mode=compile cc -I. -I/tmp/ptester-1001/thread/3/8.3dev-zts/tmp-xdebug -I/tmp/ptester-1001/thread/3/8.3dev-zts/tmp-xdebug/include -I/tmp/ptester-1001/thread/3/8.3dev-zts/tmp-xdebug/main -I/tmp/ptester-1001/thread/3/8.3dev-zts/tmp-xdebug -I/tmp/php-build/workspace/install/8.3dev-zts/include/php -I/tmp/php-build/workspace/install/8.3dev-zts/include/php/main -I/tmp/php-build/workspace/install/8.3dev-zts/include/php/TSRM -I/tmp/php-build/workspace/install/8.3dev-zts/include/php/Zend -I/tmp/php-build/workspace/install/8.3dev-zts/include/php/ext -I/tmp/php-build/workspace/install/8.3dev-zts/include/php/ext/date/lib -I/tmp/ptester-1001/thread/3/8.3dev-zts/tmp-xdebug/src -DHAVE_CONFIG_H -g -O0 -D_GNU_SOURCE -g -O0 -Wall -Wdeclaration-after-statement -Wdiscarded-qualifiers -Wempty-body -Wenum-compare -Werror -Wextra -Wformat-nonliteral -Wformat-security -Wheader-guard -Wimplicit-fallthrough -Winit-self -Wlogical-not-parentheses -Wlogical-op -Wmaybe-uninitialized -Wmissing-format-attribute -Wno-missing-field-initializers -Wno-sign-compare -Wno-unused-but-set-variable -Wno-unused-parameter -Wno-variadic-macros -Wparentheses -Wsizeof-array-argument -Wwrite-strings -Wpointer-arith -fdiagnostics-show-option -fno-exceptions -fno-omit-frame-pointer -fno-optimize-sibling-calls -fstack-protector -DZEND_COMPILE_DL_EXT=1 -c /tmp/ptester-1001/thread/3/8.3dev-zts/tmp-xdebug/src/lib/set.c -o src/lib/set.lo -MMD -MF src/lib/set.dep -MT src/lib/set.lo
/bin/bash /tmp/ptester-1001/thread/3/8.3dev-zts/tmp-xdebug/libtool --tag=CC --mode=compile cc -I. -I/tmp/ptester-1001/thread/3/8.3dev-zts/tmp-xdebug -I/tmp/ptester-1001/thread/3/8.3dev-zts/tmp-xdebug/include -I/tmp/ptester-1001/thread/3/8.3dev-zts/tmp-xdebug/main -I/tmp/ptester-1001/thread/3/8.3dev-zts/tmp-xdebug -I/tmp/php-build/workspace/install/8.3dev-zts/include/php -I/tmp/php-build/workspace/install/8.3dev-zts/include/php/main -I/tmp/php-build/workspace/install/8.3dev-zts/include/php/TSRM -I/tmp/php-build/workspace/install/8.3dev-zts/include/php/Zend -I/tmp/php-build/workspace/install/8.3dev-zts/include/php/ext -I/tmp/php-build/workspace/install/8.3dev-zts/include/php/ext/date/lib -I/tmp/ptester-1001/thread/3/8.3dev-zts/tmp-xdebug/src -DHAVE_CONFIG_H -g -O0 -D_GNU_SOURCE -g -O0 -Wall -Wdeclaration-after-statement -Wdiscarded-qualifiers -Wempty-body -Wenum-compare -Werror -Wextra -Wformat-nonliteral -Wformat-security -Wheader-guard -Wimplicit-fallthrough -Winit-self -Wlogical-not-parentheses -Wlogical-op -Wmaybe-uninitialized -Wmissing-format-attribute -Wno-missing-field-initializers -Wno-sign-compare -Wno-unused-but-set-variable -Wno-unused-parameter -Wno-variadic-macros -Wparentheses -Wsizeof-array-argument -Wwrite-strings -Wpointer-arith -fdiagnostics-show-option -fno-exceptions -fno-omit-frame-pointer -fno-optimize-sibling-calls -fstack-protector -DZEND_COMPILE_DL_EXT=1 -c /tmp/ptester-1001/thread/3/8.3dev-zts/tmp-xdebug/src/lib/str.c -o src/lib/str.lo -MMD -MF src/lib/str.dep -MT src/lib/str.lo
/bin/bash /tmp/ptester-1001/thread/3/8.3dev-zts/tmp-xdebug/libtool --tag=CC --mode=compile cc -I. -I/tmp/ptester-1001/thread/3/8.3dev-zts/tmp-xdebug -I/tmp/ptester-1001/thread/3/8.3dev-zts/tmp-xdebug/include -I/tmp/ptester-1001/thread/3/8.3dev-zts/tmp-xdebug/main -I/tmp/ptester-1001/thread/3/8.3dev-zts/tmp-xdebug -I/tmp/php-build/workspace/install/8.3dev-zts/include/php -I/tmp/php-build/workspace/install/8.3dev-zts/include/php/main -I/tmp/php-build/workspace/install/8.3dev-zts/include/php/TSRM -I/tmp/php-build/workspace/install/8.3dev-zts/include/php/Zend -I/tmp/php-build/workspace/install/8.3dev-zts/include/php/ext -I/tmp/php-build/workspace/install/8.3dev-zts/include/php/ext/date/lib -I/tmp/ptester-1001/thread/3/8.3dev-zts/tmp-xdebug/src -DHAVE_CONFIG_H -g -O0 -D_GNU_SOURCE -g -O0 -Wall -Wdeclaration-after-statement -Wdiscarded-qualifiers -Wempty-body -Wenum-compare -Werror -Wextra -Wformat-nonliteral -Wformat-security -Wheader-guard -Wimplicit-fallthrough -Winit-self -Wlogical-not-parentheses -Wlogical-op -Wmaybe-uninitialized -Wmissing-format-attribute -Wno-missing-field-initializers -Wno-sign-compare -Wno-unused-but-set-variable -Wno-unused-parameter -Wno-variadic-macros -Wparentheses -Wsizeof-array-argument -Wwrite-strings -Wpointer-arith -fdiagnostics-show-option -fno-exceptions -fno-omit-frame-pointer -fno-optimize-sibling-calls -fstack-protector -DZEND_COMPILE_DL_EXT=1 -c /tmp/ptester-1001/thread/3/8.3dev-zts/tmp-xdebug/src/lib/stripcslashes.c -o src/lib/stripcslashes.lo -MMD -MF src/lib/stripcslashes.dep -MT src/lib/stripcslashes.lo
/bin/bash /tmp/ptester-1001/thread/3/8.3dev-zts/tmp-xdebug/libtool --tag=CC --mode=compile cc -I. -I/tmp/ptester-1001/thread/3/8.3dev-zts/tmp-xdebug -I/tmp/ptester-1001/thread/3/8.3dev-zts/tmp-xdebug/include -I/tmp/ptester-1001/thread/3/8.3dev-zts/tmp-xdebug/main -I/tmp/ptester-1001/thread/3/8.3dev-zts/tmp-xdebug -I/tmp/php-build/workspace/install/8.3dev-zts/include/php -I/tmp/php-build/workspace/install/8.3dev-zts/include/php/main -I/tmp/php-build/workspace/install/8.3dev-zts/include/php/TSRM -I/tmp/php-build/workspace/install/8.3dev-zts/include/php/Zend -I/tmp/php-build/workspace/install/8.3dev-zts/include/php/ext -I/tmp/php-build/workspace/install/8.3dev-zts/include/php/ext/date/lib -I/tmp/ptester-1001/thread/3/8.3dev-zts/tmp-xdebug/src -DHAVE_CONFIG_H -g -O0 -D_GNU_SOURCE -g -O0 -Wall -Wdeclaration-after-statement -Wdiscarded-qualifiers -Wempty-body -Wenum-compare -Werror -Wextra -Wformat-nonliteral -Wformat-security -Wheader-guard -Wimplicit-fallthrough -Winit-self -Wlogical-not-parentheses -Wlogical-op -Wmaybe-uninitialized -Wmissing-format-attribute -Wno-missing-field-initializers -Wno-sign-compare -Wno-unused-but-set-variable -Wno-unused-parameter -Wno-variadic-macros -Wparentheses -Wsizeof-array-argument -Wwrite-strings -Wpointer-arith -fdiagnostics-show-option -fno-exceptions -fno-omit-frame-pointer -fno-optimize-sibling-calls -fstack-protector -DZEND_COMPILE_DL_EXT=1 -c /tmp/ptester-1001/thread/3/8.3dev-zts/tmp-xdebug/src/lib/timing.c -o src/lib/timing.lo -MMD -MF src/lib/timing.dep -MT src/lib/timing.lo
mkdir src/lib/.libs
cc -I. -I/tmp/ptester-1001/thread/3/8.3dev-zts/tmp-xdebug -I/tmp/ptester-1001/thread/3/8.3dev-zts/tmp-xdebug/include -I/tmp/ptester-1001/thread/3/8.3dev-zts/tmp-xdebug/main -I/tmp/ptester-1001/thread/3/8.3dev-zts/tmp-xdebug -I/tmp/php-build/workspace/install/8.3dev-zts/include/php -I/tmp/php-build/workspace/install/8.3dev-zts/include/php/main -I/tmp/php-build/workspace/install/8.3dev-zts/include/php/TSRM -I/tmp/php-build/workspace/install/8.3dev-zts/include/php/Zend -I/tmp/php-build/workspace/install/8.3dev-zts/include/php/ext -I/tmp/php-build/workspace/install/8.3dev-zts/include/php/ext/date/lib -I/tmp/ptester-1001/thread/3/8.3dev-zts/tmp-xdebug/src -DHAVE_CONFIG_H -g -O0 -D_GNU_SOURCE -g -O0 -Wall -Wdeclaration-after-statement -Wdiscarded-qualifiers -Wempty-body -Wenum-compare -Werror -Wextra -Wformat-nonliteral -Wformat-security -Wheader-guard -Wimplicit-fallthrough -Winit-self -Wlogical-not-parentheses -Wlogical-op -Wmaybe-uninitialized -Wmissing-format-attribute -Wno-missing-field-initializers -Wno-sign-compare -Wno-unused-but-set-variable -Wno-unused-parameter -Wno-variadic-macros -Wparentheses -Wsizeof-array-argument -Wwrite-strings -Wpointer-arith -fdiagnostics-show-option -fno-exceptions -fno-omit-frame-pointer -fno-optimize-sibling-calls -fstack-protector -DZEND_COMPILE_DL_EXT=1 -c /tmp/ptester-1001/thread/3/8.3dev-zts/tmp-xdebug/src/lib/arg.c -MMD -MF src/lib/arg.dep -MT src/lib/arg.lo -fPIC -DPIC -o src/lib/.libs/arg.o
cc -I. -I/tmp/ptester-1001/thread/3/8.3dev-zts/tmp-xdebug -I/tmp/ptester-1001/thread/3/8.3dev-zts/tmp-xdebug/include -I/tmp/ptester-1001/thread/3/8.3dev-zts/tmp-xdebug/main -I/tmp/ptester-1001/thread/3/8.3dev-zts/tmp-xdebug -I/tmp/php-build/workspace/install/8.3dev-zts/include/php -I/tmp/php-build/workspace/install/8.3dev-zts/include/php/main -I/tmp/php-build/workspace/install/8.3dev-zts/include/php/TSRM -I/tmp/php-build/workspace/install/8.3dev-zts/include/php/Zend -I/tmp/php-build/workspace/install/8.3dev-zts/include/php/ext -I/tmp/php-build/workspace/install/8.3dev-zts/include/php/ext/date/lib -I/tmp/ptester-1001/thread/3/8.3dev-zts/tmp-xdebug/src -DHAVE_CONFIG_H -g -O0 -D_GNU_SOURCE -g -O0 -Wall -Wdeclaration-after-statement -Wdiscarded-qualifiers -Wempty-body -Wenum-compare -Werror -Wextra -Wformat-nonliteral -Wformat-security -Wheader-guard -Wimplicit-fallthrough -Winit-self -Wlogical-not-parentheses -Wlogical-op -Wmaybe-uninitialized -Wmissing-format-attribute -Wno-missing-field-initializers -Wno-sign-compare -Wno-unused-but-set-variable -Wno-unused-parameter -Wno-variadic-macros -Wparentheses -Wsizeof-array-argument -Wwrite-strings -Wpointer-arith -fdiagnostics-show-option -fno-exceptions -fno-omit-frame-pointer -fno-optimize-sibling-calls -fstack-protector -DZEND_COMPILE_DL_EXT=1 -c /tmp/ptester-1001/thread/3/8.3dev-zts/tmp-xdebug/src/lib/headers.c -MMD -MF src/lib/headers.dep -MT src/lib/headers.lo -fPIC -DPIC -o src/lib/.libs/headers.o
cc -I. -I/tmp/ptester-1001/thread/3/8.3dev-zts/tmp-xdebug -I/tmp/ptester-1001/thread/3/8.3dev-zts/tmp-xdebug/include -I/tmp/ptester-1001/thread/3/8.3dev-zts/tmp-xdebug/main -I/tmp/ptester-1001/thread/3/8.3dev-zts/tmp-xdebug -I/tmp/php-build/workspace/install/8.3dev-zts/include/php -I/tmp/php-build/workspace/install/8.3dev-zts/include/php/main -I/tmp/php-build/workspace/install/8.3dev-zts/include/php/TSRM -I/tmp/php-build/workspace/install/8.3dev-zts/include/php/Zend -I/tmp/php-build/workspace/install/8.3dev-zts/include/php/ext -I/tmp/php-build/workspace/install/8.3dev-zts/include/php/ext/date/lib -I/tmp/ptester-1001/thread/3/8.3dev-zts/tmp-xdebug/src -DHAVE_CONFIG_H -g -O0 -D_GNU_SOURCE -g -O0 -Wall -Wdeclaration-after-statement -Wdiscarded-qualifiers -Wempty-body -Wenum-compare -Werror -Wextra -Wformat-nonliteral -Wformat-security -Wheader-guard -Wimplicit-fallthrough -Winit-self -Wlogical-not-parentheses -Wlogical-op -Wmaybe-uninitialized -Wmissing-format-attribute -Wno-missing-field-initializers -Wno-sign-compare -Wno-unused-but-set-variable -Wno-unused-parameter -Wno-variadic-macros -Wparentheses -Wsizeof-array-argument -Wwrite-strings -Wpointer-arith -fdiagnostics-show-option -fno-exceptions -fno-omit-frame-pointer -fno-optimize-sibling-calls -fstack-protector -DZEND_COMPILE_DL_EXT=1 -c /tmp/ptester-1001/thread/3/8.3dev-zts/tmp-xdebug/src/lib/crc32.c -MMD -MF src/lib/crc32.dep -MT src/lib/crc32.lo -fPIC -DPIC -o src/lib/.libs/crc32.o
cc -I. -I/tmp/ptester-1001/thread/3/8.3dev-zts/tmp-xdebug -I/tmp/ptester-1001/thread/3/8.3dev-zts/tmp-xdebug/include -I/tmp/ptester-1001/thread/3/8.3dev-zts/tmp-xdebug/main -I/tmp/ptester-1001/thread/3/8.3dev-zts/tmp-xdebug -I/tmp/php-build/workspace/install/8.3dev-zts/include/php -I/tmp/php-build/workspace/install/8.3dev-zts/include/php/main -I/tmp/php-build/workspace/install/8.3dev-zts/include/php/TSRM -I/tmp/php-build/workspace/install/8.3dev-zts/include/php/Zend -I/tmp/php-build/workspace/install/8.3dev-zts/include/php/ext -I/tmp/php-build/workspace/install/8.3dev-zts/include/php/ext/date/lib -I/tmp/ptester-1001/thread/3/8.3dev-zts/tmp-xdebug/src -DHAVE_CONFIG_H -g -O0 -D_GNU_SOURCE -g -O0 -Wall -Wdeclaration-after-statement -Wdiscarded-qualifiers -Wempty-body -Wenum-compare -Werror -Wextra -Wformat-nonliteral -Wformat-security -Wheader-guard -Wimplicit-fallthrough -Winit-self -Wlogical-not-parentheses -Wlogical-op -Wmaybe-uninitialized -Wmissing-format-attribute -Wno-missing-field-initializers -Wno-sign-compare -Wno-unused-but-set-variable -Wno-unused-parameter -Wno-variadic-macros -Wparentheses -Wsizeof-array-argument -Wwrite-strings -Wpointer-arith -fdiagnostics-show-option -fno-exceptions -fno-omit-frame-pointer -fno-optimize-sibling-calls -fstack-protector -DZEND_COMPILE_DL_EXT=1 -c /tmp/ptester-1001/thread/3/8.3dev-zts/tmp-xdebug/src/lib/hash.c -MMD -MF src/lib/hash.dep -MT src/lib/hash.lo -fPIC -DPIC -o src/lib/.libs/hash.o
cc -I. -I/tmp/ptester-1001/thread/3/8.3dev-zts/tmp-xdebug -I/tmp/ptester-1001/thread/3/8.3dev-zts/tmp-xdebug/include -I/tmp/ptester-1001/thread/3/8.3dev-zts/tmp-xdebug/main -I/tmp/ptester-1001/thread/3/8.3dev-zts/tmp-xdebug -I/tmp/php-build/workspace/install/8.3dev-zts/include/php -I/tmp/php-build/workspace/install/8.3dev-zts/include/php/main -I/tmp/php-build/workspace/install/8.3dev-zts/include/php/TSRM -I/tmp/php-build/workspace/install/8.3dev-zts/include/php/Zend -I/tmp/php-build/workspace/install/8.3dev-zts/include/php/ext -I/tmp/php-build/workspace/install/8.3dev-zts/include/php/ext/date/lib -I/tmp/ptester-1001/thread/3/8.3dev-zts/tmp-xdebug/src -DHAVE_CONFIG_H -g -O0 -D_GNU_SOURCE -g -O0 -Wall -Wdeclaration-after-statement -Wdiscarded-qualifiers -Wempty-body -Wenum-compare -Werror -Wextra -Wformat-nonliteral -Wformat-security -Wheader-guard -Wimplicit-fallthrough -Winit-self -Wlogical-not-parentheses -Wlogical-op -Wmaybe-uninitialized -Wmissing-format-attribute -Wno-missing-field-initializers -Wno-sign-compare -Wno-unused-but-set-variable -Wno-unused-parameter -Wno-variadic-macros -Wparentheses -Wsizeof-array-argument -Wwrite-strings -Wpointer-arith -fdiagnostics-show-option -fno-exceptions -fno-omit-frame-pointer -fno-optimize-sibling-calls -fstack-protector -DZEND_COMPILE_DL_EXT=1 -c /tmp/ptester-1001/thread/3/8.3dev-zts/tmp-xdebug/src/lib/usefulstuff.c -MMD -MF src/lib/usefulstuff.dep -MT src/lib/usefulstuff.lo -fPIC -DPIC -o src/lib/.libs/usefulstuff.o
cc -I. -I/tmp/ptester-1001/thread/3/8.3dev-zts/tmp-xdebug -I/tmp/ptester-1001/thread/3/8.3dev-zts/tmp-xdebug/include -I/tmp/ptester-1001/thread/3/8.3dev-zts/tmp-xdebug/main -I/tmp/ptester-1001/thread/3/8.3dev-zts/tmp-xdebug -I/tmp/php-build/workspace/install/8.3dev-zts/include/php -I/tmp/php-build/workspace/install/8.3dev-zts/include/php/main -I/tmp/php-build/workspace/install/8.3dev-zts/include/php/TSRM -I/tmp/php-build/workspace/install/8.3dev-zts/include/php/Zend -I/tmp/php-build/workspace/install/8.3dev-zts/include/php/ext -I/tmp/php-build/workspace/install/8.3dev-zts/include/php/ext/date/lib -I/tmp/ptester-1001/thread/3/8.3dev-zts/tmp-xdebug/src -DHAVE_CONFIG_H -g -O0 -D_GNU_SOURCE -g -O0 -Wall -Wdeclaration-after-statement -Wdiscarded-qualifiers -Wempty-body -Wenum-compare -Werror -Wextra -Wformat-nonliteral -Wformat-security -Wheader-guard -Wimplicit-fallthrough -Winit-self -Wlogical-not-parentheses -Wlogical-op -Wmaybe-uninitialized -Wmissing-format-attribute -Wno-missing-field-initializers -Wno-sign-compare -Wno-unused-but-set-variable -Wno-unused-parameter -Wno-variadic-macros -Wparentheses -Wsizeof-array-argument -Wwrite-strings -Wpointer-arith -fdiagnostics-show-option -fno-exceptions -fno-omit-frame-pointer -fno-optimize-sibling-calls -fstack-protector -DZEND_COMPILE_DL_EXT=1 -c /tmp/ptester-1001/thread/3/8.3dev-zts/tmp-xdebug/src/lib/set.c -MMD -MF src/lib/set.dep -MT src/lib/set.lo -fPIC -DPIC -o src/lib/.libs/set.o
cc -I. -I/tmp/ptester-1001/thread/3/8.3dev-zts/tmp-xdebug -I/tmp/ptester-1001/thread/3/8.3dev-zts/tmp-xdebug/include -I/tmp/ptester-1001/thread/3/8.3dev-zts/tmp-xdebug/main -I/tmp/ptester-1001/thread/3/8.3dev-zts/tmp-xdebug -I/tmp/php-build/workspace/install/8.3dev-zts/include/php -I/tmp/php-build/workspace/install/8.3dev-zts/include/php/main -I/tmp/php-build/workspace/install/8.3dev-zts/include/php/TSRM -I/tmp/php-build/workspace/install/8.3dev-zts/include/php/Zend -I/tmp/php-build/workspace/install/8.3dev-zts/include/php/ext -I/tmp/php-build/workspace/install/8.3dev-zts/include/php/ext/date/lib -I/tmp/ptester-1001/thread/3/8.3dev-zts/tmp-xdebug/src -DHAVE_CONFIG_H -g -O0 -D_GNU_SOURCE -g -O0 -Wall -Wdeclaration-after-statement -Wdiscarded-qualifiers -Wempty-body -Wenum-compare -Werror -Wextra -Wformat-nonliteral -Wformat-security -Wheader-guard -Wimplicit-fallthrough -Winit-self -Wlogical-not-parentheses -Wlogical-op -Wmaybe-uninitialized -Wmissing-format-attribute -Wno-missing-field-initializers -Wno-sign-compare -Wno-unused-but-set-variable -Wno-unused-parameter -Wno-variadic-macros -Wparentheses -Wsizeof-array-argument -Wwrite-strings -Wpointer-arith -fdiagnostics-show-option -fno-exceptions -fno-omit-frame-pointer -fno-optimize-sibling-calls -fstack-protector -DZEND_COMPILE_DL_EXT=1 -c /tmp/ptester-1001/thread/3/8.3dev-zts/tmp-xdebug/src/lib/file.c -MMD -MF src/lib/file.dep -MT src/lib/file.lo -fPIC -DPIC -o src/lib/.libs/file.o
cc -I. -I/tmp/ptester-1001/thread/3/8.3dev-zts/tmp-xdebug -I/tmp/ptester-1001/thread/3/8.3dev-zts/tmp-xdebug/include -I/tmp/ptester-1001/thread/3/8.3dev-zts/tmp-xdebug/main -I/tmp/ptester-1001/thread/3/8.3dev-zts/tmp-xdebug -I/tmp/php-build/workspace/install/8.3dev-zts/include/php -I/tmp/php-build/workspace/install/8.3dev-zts/include/php/main -I/tmp/php-build/workspace/install/8.3dev-zts/include/php/TSRM -I/tmp/php-build/workspace/install/8.3dev-zts/include/php/Zend -I/tmp/php-build/workspace/install/8.3dev-zts/include/php/ext -I/tmp/php-build/workspace/install/8.3dev-zts/include/php/ext/date/lib -I/tmp/ptester-1001/thread/3/8.3dev-zts/tmp-xdebug/src -DHAVE_CONFIG_H -g -O0 -D_GNU_SOURCE -g -O0 -Wall -Wdeclaration-after-statement -Wdiscarded-qualifiers -Wempty-body -Wenum-compare -Werror -Wextra -Wformat-nonliteral -Wformat-security -Wheader-guard -Wimplicit-fallthrough -Winit-self -Wlogical-not-parentheses -Wlogical-op -Wmaybe-uninitialized -Wmissing-format-attribute -Wno-missing-field-initializers -Wno-sign-compare -Wno-unused-but-set-variable -Wno-unused-parameter -Wno-variadic-macros -Wparentheses -Wsizeof-array-argument -Wwrite-strings -Wpointer-arith -fdiagnostics-show-option -fno-exceptions -fno-omit-frame-pointer -fno-optimize-sibling-calls -fstack-protector -DZEND_COMPILE_DL_EXT=1 -c /tmp/ptester-1001/thread/3/8.3dev-zts/tmp-xdebug/src/lib/normalize_path.c -MMD -MF src/lib/normalize_path.dep -MT src/lib/normalize_path.lo -fPIC -DPIC -o src/lib/.libs/normalize_path.o
mkdir src/base/.libs
/bin/bash /tmp/ptester-1001/thread/3/8.3dev-zts/tmp-xdebug/libtool --tag=CC --mode=compile cc -I. -I/tmp/ptester-1001/thread/3/8.3dev-zts/tmp-xdebug -I/tmp/ptester-1001/thread/3/8.3dev-zts/tmp-xdebug/include -I/tmp/ptester-1001/thread/3/8.3dev-zts/tmp-xdebug/main -I/tmp/ptester-1001/thread/3/8.3dev-zts/tmp-xdebug -I/tmp/php-build/workspace/install/8.3dev-zts/include/php -I/tmp/php-build/workspace/install/8.3dev-zts/include/php/main -I/tmp/php-build/workspace/install/8.3dev-zts/include/php/TSRM -I/tmp/php-build/workspace/install/8.3dev-zts/include/php/Zend -I/tmp/php-build/workspace/install/8.3dev-zts/include/php/ext -I/tmp/php-build/workspace/install/8.3dev-zts/include/php/ext/date/lib -I/tmp/ptester-1001/thread/3/8.3dev-zts/tmp-xdebug/src -DHAVE_CONFIG_H -g -O0 -D_GNU_SOURCE -g -O0 -Wall -Wdeclaration-after-statement -Wdiscarded-qualifiers -Wempty-body -Wenum-compare -Werror -Wextra -Wformat-nonliteral -Wformat-security -Wheader-guard -Wimplicit-fallthrough -Winit-self -Wlogical-not-parentheses -Wlogical-op -Wmaybe-uninitialized -Wmissing-format-attribute -Wno-missing-field-initializers -Wno-sign-compare -Wno-unused-but-set-variable -Wno-unused-parameter -Wno-variadic-macros -Wparentheses -Wsizeof-array-argument -Wwrite-strings -Wpointer-arith -fdiagnostics-show-option -fno-exceptions -fno-omit-frame-pointer -fno-optimize-sibling-calls -fstack-protector -DZEND_COMPILE_DL_EXT=1 -c /tmp/ptester-1001/thread/3/8.3dev-zts/tmp-xdebug/src/lib/trim.c -o src/lib/trim.lo -MMD -MF src/lib/trim.dep -MT src/lib/trim.lo
cc -I. -I/tmp/ptester-1001/thread/3/8.3dev-zts/tmp-xdebug -I/tmp/ptester-1001/thread/3/8.3dev-zts/tmp-xdebug/include -I/tmp/ptester-1001/thread/3/8.3dev-zts/tmp-xdebug/main -I/tmp/ptester-1001/thread/3/8.3dev-zts/tmp-xdebug -I/tmp/php-build/workspace/install/8.3dev-zts/include/php -I/tmp/php-build/workspace/install/8.3dev-zts/include/php/main -I/tmp/php-build/workspace/install/8.3dev-zts/include/php/TSRM -I/tmp/php-build/workspace/install/8.3dev-zts/include/php/Zend -I/tmp/php-build/workspace/install/8.3dev-zts/include/php/ext -I/tmp/php-build/workspace/install/8.3dev-zts/include/php/ext/date/lib -I/tmp/ptester-1001/thread/3/8.3dev-zts/tmp-xdebug/src -DHAVE_CONFIG_H -g -O0 -D_GNU_SOURCE -g -O0 -Wall -Wdeclaration-after-statement -Wdiscarded-qualifiers -Wempty-body -Wenum-compare -Werror -Wextra -Wformat-nonliteral -Wformat-security -Wheader-guard -Wimplicit-fallthrough -Winit-self -Wlogical-not-parentheses -Wlogical-op -Wmaybe-uninitialized -Wmissing-format-attribute -Wno-missing-field-initializers -Wno-sign-compare -Wno-unused-but-set-variable -Wno-unused-parameter -Wno-variadic-macros -Wparentheses -Wsizeof-array-argument -Wwrite-strings -Wpointer-arith -fdiagnostics-show-option -fno-exceptions -fno-omit-frame-pointer -fno-optimize-sibling-calls -fstack-protector -DZEND_COMPILE_DL_EXT=1 -c /tmp/ptester-1001/thread/3/8.3dev-zts/tmp-xdebug/src/base/ctrl_socket.c -MMD -MF src/base/ctrl_socket.dep -MT src/base/ctrl_socket.lo -fPIC -DPIC -o src/base/.libs/ctrl_socket.o
cc -I. -I/tmp/ptester-1001/thread/3/8.3dev-zts/tmp-xdebug -I/tmp/ptester-1001/thread/3/8.3dev-zts/tmp-xdebug/include -I/tmp/ptester-1001/thread/3/8.3dev-zts/tmp-xdebug/main -I/tmp/ptester-1001/thread/3/8.3dev-zts/tmp-xdebug -I/tmp/php-build/workspace/install/8.3dev-zts/include/php -I/tmp/php-build/workspace/install/8.3dev-zts/include/php/main -I/tmp/php-build/workspace/install/8.3dev-zts/include/php/TSRM -I/tmp/php-build/workspace/install/8.3dev-zts/include/php/Zend -I/tmp/php-build/workspace/install/8.3dev-zts/include/php/ext -I/tmp/php-build/workspace/install/8.3dev-zts/include/php/ext/date/lib -I/tmp/ptester-1001/thread/3/8.3dev-zts/tmp-xdebug/src -DHAVE_CONFIG_H -g -O0 -D_GNU_SOURCE -g -O0 -Wall -Wdeclaration-after-statement -Wdiscarded-qualifiers -Wempty-body -Wenum-compare -Werror -Wextra -Wformat-nonliteral -Wformat-security -Wheader-guard -Wimplicit-fallthrough -Winit-self -Wlogical-not-parentheses -Wlogical-op -Wmaybe-uninitialized -Wmissing-format-attribute -Wno-missing-field-initializers -Wno-sign-compare -Wno-unused-but-set-variable -Wno-unused-parameter -Wno-variadic-macros -Wparentheses -Wsizeof-array-argument -Wwrite-strings -Wpointer-arith -fdiagnostics-show-option -fno-exceptions -fno-omit-frame-pointer -fno-optimize-sibling-calls -fstack-protector -DZEND_COMPILE_DL_EXT=1 -c /tmp/ptester-1001/thread/3/8.3dev-zts/tmp-xdebug/src/lib/compat.c -MMD -MF src/lib/compat.dep -MT src/lib/compat.lo -fPIC -DPIC -o src/lib/.libs/compat.o
/bin/bash /tmp/ptester-1001/thread/3/8.3dev-zts/tmp-xdebug/libtool --tag=CC --mode=compile cc -I. -I/tmp/ptester-1001/thread/3/8.3dev-zts/tmp-xdebug -I/tmp/ptester-1001/thread/3/8.3dev-zts/tmp-xdebug/include -I/tmp/ptester-1001/thread/3/8.3dev-zts/tmp-xdebug/main -I/tmp/ptester-1001/thread/3/8.3dev-zts/tmp-xdebug -I/tmp/php-build/workspace/install/8.3dev-zts/include/php -I/tmp/php-build/workspace/install/8.3dev-zts/include/php/main -I/tmp/php-build/workspace/install/8.3dev-zts/include/php/TSRM -I/tmp/php-build/workspace/install/8.3dev-zts/include/php/Zend -I/tmp/php-build/workspace/install/8.3dev-zts/include/php/ext -I/tmp/php-build/workspace/install/8.3dev-zts/include/php/ext/date/lib -I/tmp/ptester-1001/thread/3/8.3dev-zts/tmp-xdebug/src -DHAVE_CONFIG_H -g -O0 -D_GNU_SOURCE -g -O0 -Wall -Wdeclaration-after-statement -Wdiscarded-qualifiers -Wempty-body -Wenum-compare -Werror -Wextra -Wformat-nonliteral -Wformat-security -Wheader-guard -Wimplicit-fallthrough -Winit-self -Wlogical-not-parentheses -Wlogical-op -Wmaybe-uninitialized -Wmissing-format-attribute -Wno-missing-field-initializers -Wno-sign-compare -Wno-unused-but-set-variable -Wno-unused-parameter -Wno-variadic-macros -Wparentheses -Wsizeof-array-argument -Wwrite-strings -Wpointer-arith -fdiagnostics-show-option -fno-exceptions -fno-omit-frame-pointer -fno-optimize-sibling-calls -fstack-protector -DZEND_COMPILE_DL_EXT=1 -c /tmp/ptester-1001/thread/3/8.3dev-zts/tmp-xdebug/src/lib/var.c -o src/lib/var.lo -MMD -MF src/lib/var.dep -MT src/lib/var.lo
cc -I. -I/tmp/ptester-1001/thread/3/8.3dev-zts/tmp-xdebug -I/tmp/ptester-1001/thread/3/8.3dev-zts/tmp-xdebug/include -I/tmp/ptester-1001/thread/3/8.3dev-zts/tmp-xdebug/main -I/tmp/ptester-1001/thread/3/8.3dev-zts/tmp-xdebug -I/tmp/php-build/workspace/install/8.3dev-zts/include/php -I/tmp/php-build/workspace/install/8.3dev-zts/include/php/main -I/tmp/php-build/workspace/install/8.3dev-zts/include/php/TSRM -I/tmp/php-build/workspace/install/8.3dev-zts/include/php/Zend -I/tmp/php-build/workspace/install/8.3dev-zts/include/php/ext -I/tmp/php-build/workspace/install/8.3dev-zts/include/php/ext/date/lib -I/tmp/ptester-1001/thread/3/8.3dev-zts/tmp-xdebug/src -DHAVE_CONFIG_H -g -O0 -D_GNU_SOURCE -g -O0 -Wall -Wdeclaration-after-statement -Wdiscarded-qualifiers -Wempty-body -Wenum-compare -Werror -Wextra -Wformat-nonliteral -Wformat-security -Wheader-guard -Wimplicit-fallthrough -Winit-self -Wlogical-not-parentheses -Wlogical-op -Wmaybe-uninitialized -Wmissing-format-attribute -Wno-missing-field-initializers -Wno-sign-compare -Wno-unused-but-set-variable -Wno-unused-parameter -Wno-variadic-macros -Wparentheses -Wsizeof-array-argument -Wwrite-strings -Wpointer-arith -fdiagnostics-show-option -fno-exceptions -fno-omit-frame-pointer -fno-optimize-sibling-calls -fstack-protector -DZEND_COMPILE_DL_EXT=1 -c /tmp/ptester-1001/thread/3/8.3dev-zts/tmp-xdebug/src/lib/timing.c -MMD -MF src/lib/timing.dep -MT src/lib/timing.lo -fPIC -DPIC -o src/lib/.libs/timing.o
cc -I. -I/tmp/ptester-1001/thread/3/8.3dev-zts/tmp-xdebug -I/tmp/ptester-1001/thread/3/8.3dev-zts/tmp-xdebug/include -I/tmp/ptester-1001/thread/3/8.3dev-zts/tmp-xdebug/main -I/tmp/ptester-1001/thread/3/8.3dev-zts/tmp-xdebug -I/tmp/php-build/workspace/install/8.3dev-zts/include/php -I/tmp/php-build/workspace/install/8.3dev-zts/include/php/main -I/tmp/php-build/workspace/install/8.3dev-zts/include/php/TSRM -I/tmp/php-build/workspace/install/8.3dev-zts/include/php/Zend -I/tmp/php-build/workspace/install/8.3dev-zts/include/php/ext -I/tmp/php-build/workspace/install/8.3dev-zts/include/php/ext/date/lib -I/tmp/ptester-1001/thread/3/8.3dev-zts/tmp-xdebug/src -DHAVE_CONFIG_H -g -O0 -D_GNU_SOURCE -g -O0 -Wall -Wdeclaration-after-statement -Wdiscarded-qualifiers -Wempty-body -Wenum-compare -Werror -Wextra -Wformat-nonliteral -Wformat-security -Wheader-guard -Wimplicit-fallthrough -Winit-self -Wlogical-not-parentheses -Wlogical-op -Wmaybe-uninitialized -Wmissing-format-attribute -Wno-missing-field-initializers -Wno-sign-compare -Wno-unused-but-set-variable -Wno-unused-parameter -Wno-variadic-macros -Wparentheses -Wsizeof-array-argument -Wwrite-strings -Wpointer-arith -fdiagnostics-show-option -fno-exceptions -fno-omit-frame-pointer -fno-optimize-sibling-calls -fstack-protector -DZEND_COMPILE_DL_EXT=1 -c /tmp/ptester-1001/thread/3/8.3dev-zts/tmp-xdebug/src/lib/llist.c -MMD -MF src/lib/llist.dep -MT src/lib/llist.lo -fPIC -DPIC -o src/lib/.libs/llist.o
/tmp/ptester-1001/thread/3/8.3dev-zts/tmp-xdebug/src/lib/usefulstuff.c: In function ‘xdebug_strrstr’:
/tmp/ptester-1001/thread/3/8.3dev-zts/tmp-xdebug/src/lib/usefulstuff.c:79:23: error: assignment discards ‘const’ qualifier from pointer target type [-Werror=discarded-qualifiers]
79 | while ((found = strstr(haystack + pos, needle)) != 0) {
| ^
/tmp/ptester-1001/thread/3/8.3dev-zts/tmp-xdebug/src/lib/usefulstuff.c: In function ‘xdebug_path_from_url’:
/tmp/ptester-1001/thread/3/8.3dev-zts/tmp-xdebug/src/lib/usefulstuff.c:171:13: error: assignment discards ‘const’ qualifier from pointer target type [-Werror=discarded-qualifiers]
171 | tmp = strstr(fp, "file://");
| ^
cc1: all warnings being treated as errors
make: *** [Makefile:281: src/lib/usefulstuff.lo] Error 1
make: *** Waiting for unfinished jobs....
cc -I. -I/tmp/ptester-1001/thread/3/8.3dev-zts/tmp-xdebug -I/tmp/ptester-1001/thread/3/8.3dev-zts/tmp-xdebug/include -I/tmp/ptester-1001/thread/3/8.3dev-zts/tmp-xdebug/main -I/tmp/ptester-1001/thread/3/8.3dev-zts/tmp-xdebug -I/tmp/php-build/workspace/install/8.3dev-zts/include/php -I/tmp/php-build/workspace/install/8.3dev-zts/include/php/main -I/tmp/php-build/workspace/install/8.3dev-zts/include/php/TSRM -I/tmp/php-build/workspace/install/8.3dev-zts/include/php/Zend -I/tmp/php-build/workspace/install/8.3dev-zts/include/php/ext -I/tmp/php-build/workspace/install/8.3dev-zts/include/php/ext/date/lib -I/tmp/ptester-1001/thread/3/8.3dev-zts/tmp-xdebug/src -DHAVE_CONFIG_H -g -O0 -D_GNU_SOURCE -g -O0 -Wall -Wdeclaration-after-statement -Wdiscarded-qualifiers -Wempty-body -Wenum-compare -Werror -Wextra -Wformat-nonliteral -Wformat-security -Wheader-guard -Wimplicit-fallthrough -Winit-self -Wlogical-not-parentheses -Wlogical-op -Wmaybe-uninitialized -Wmissing-format-attribute -Wno-missing-field-initializers -Wno-sign-compare -Wno-unused-but-set-variable -Wno-unused-parameter -Wno-variadic-macros -Wparentheses -Wsizeof-array-argument -Wwrite-strings -Wpointer-arith -fdiagnostics-show-option -fno-exceptions -fno-omit-frame-pointer -fno-optimize-sibling-calls -fstack-protector -DZEND_COMPILE_DL_EXT=1 -c /tmp/ptester-1001/thread/3/8.3dev-zts/tmp-xdebug/src/lib/stripcslashes.c -MMD -MF src/lib/stripcslashes.dep -MT src/lib/stripcslashes.lo -fPIC -DPIC -o src/lib/.libs/stripcslashes.o
cc -I. -I/tmp/ptester-1001/thread/3/8.3dev-zts/tmp-xdebug -I/tmp/ptester-1001/thread/3/8.3dev-zts/tmp-xdebug/include -I/tmp/ptester-1001/thread/3/8.3dev-zts/tmp-xdebug/main -I/tmp/ptester-1001/thread/3/8.3dev-zts/tmp-xdebug -I/tmp/php-build/workspace/install/8.3dev-zts/include/php -I/tmp/php-build/workspace/install/8.3dev-zts/include/php/main -I/tmp/php-build/workspace/install/8.3dev-zts/include/php/TSRM -I/tmp/php-build/workspace/install/8.3dev-zts/include/php/Zend -I/tmp/php-build/workspace/install/8.3dev-zts/include/php/ext -I/tmp/php-build/workspace/install/8.3dev-zts/include/php/ext/date/lib -I/tmp/ptester-1001/thread/3/8.3dev-zts/tmp-xdebug/src -DHAVE_CONFIG_H -g -O0 -D_GNU_SOURCE -g -O0 -Wall -Wdeclaration-after-statement -Wdiscarded-qualifiers -Wempty-body -Wenum-compare -Werror -Wextra -Wformat-nonliteral -Wformat-security -Wheader-guard -Wimplicit-fallthrough -Winit-self -Wlogical-not-parentheses -Wlogical-op -Wmaybe-uninitialized -Wmissing-format-attribute -Wno-missing-field-initializers -Wno-sign-compare -Wno-unused-but-set-variable -Wno-unused-parameter -Wno-variadic-macros -Wparentheses -Wsizeof-array-argument -Wwrite-strings -Wpointer-arith -fdiagnostics-show-option -fno-exceptions -fno-omit-frame-pointer -fno-optimize-sibling-calls -fstack-protector -DZEND_COMPILE_DL_EXT=1 -c /tmp/ptester-1001/thread/3/8.3dev-zts/tmp-xdebug/src/lib/lib.c -MMD -MF src/lib/lib.dep -MT src/lib/lib.lo -fPIC -DPIC -o src/lib/.libs/lib.o
cc -I. -I/tmp/ptester-1001/thread/3/8.3dev-zts/tmp-xdebug -I/tmp/ptester-1001/thread/3/8.3dev-zts/tmp-xdebug/include -I/tmp/ptester-1001/thread/3/8.3dev-zts/tmp-xdebug/main -I/tmp/ptester-1001/thread/3/8.3dev-zts/tmp-xdebug -I/tmp/php-build/workspace/install/8.3dev-zts/include/php -I/tmp/php-build/workspace/install/8.3dev-zts/include/php/main -I/tmp/php-build/workspace/install/8.3dev-zts/include/php/TSRM -I/tmp/php-build/workspace/install/8.3dev-zts/include/php/Zend -I/tmp/php-build/workspace/install/8.3dev-zts/include/php/ext -I/tmp/php-build/workspace/install/8.3dev-zts/include/php/ext/date/lib -I/tmp/ptester-1001/thread/3/8.3dev-zts/tmp-xdebug/src -DHAVE_CONFIG_H -g -O0 -D_GNU_SOURCE -g -O0 -Wall -Wdeclaration-after-statement -Wdiscarded-qualifiers -Wempty-body -Wenum-compare -Werror -Wextra -Wformat-nonliteral -Wformat-security -Wheader-guard -Wimplicit-fallthrough -Winit-self -Wlogical-not-parentheses -Wlogical-op -Wmaybe-uninitialized -Wmissing-format-attribute -Wno-missing-field-initializers -Wno-sign-compare -Wno-unused-but-set-variable -Wno-unused-parameter -Wno-variadic-macros -Wparentheses -Wsizeof-array-argument -Wwrite-strings -Wpointer-arith -fdiagnostics-show-option -fno-exceptions -fno-omit-frame-pointer -fno-optimize-sibling-calls -fstack-protector -DZEND_COMPILE_DL_EXT=1 -c /tmp/ptester-1001/thread/3/8.3dev-zts/tmp-xdebug/src/base/base.c -MMD -MF src/base/base.dep -MT src/base/base.lo -fPIC -DPIC -o src/base/.libs/base.o
mkdir .libs
cc -I. -I/tmp/ptester-1001/thread/3/8.3dev-zts/tmp-xdebug -I/tmp/ptester-1001/thread/3/8.3dev-zts/tmp-xdebug/include -I/tmp/ptester-1001/thread/3/8.3dev-zts/tmp-xdebug/main -I/tmp/ptester-1001/thread/3/8.3dev-zts/tmp-xdebug -I/tmp/php-build/workspace/install/8.3dev-zts/include/php -I/tmp/php-build/workspace/install/8.3dev-zts/include/php/main -I/tmp/php-build/workspace/install/8.3dev-zts/include/php/TSRM -I/tmp/php-build/workspace/install/8.3dev-zts/include/php/Zend -I/tmp/php-build/workspace/install/8.3dev-zts/include/php/ext -I/tmp/php-build/workspace/install/8.3dev-zts/include/php/ext/date/lib -I/tmp/ptester-1001/thread/3/8.3dev-zts/tmp-xdebug/src -DHAVE_CONFIG_H -g -O0 -D_GNU_SOURCE -g -O0 -Wall -Wdeclaration-after-statement -Wdiscarded-qualifiers -Wempty-body -Wenum-compare -Werror -Wextra -Wformat-nonliteral -Wformat-security -Wheader-guard -Wimplicit-fallthrough -Winit-self -Wlogical-not-parentheses -Wlogical-op -Wmaybe-uninitialized -Wmissing-format-attribute -Wno-missing-field-initializers -Wno-sign-compare -Wno-unused-but-set-variable -Wno-unused-parameter -Wno-variadic-macros -Wparentheses -Wsizeof-array-argument -Wwrite-strings -Wpointer-arith -fdiagnostics-show-option -fno-exceptions -fno-omit-frame-pointer -fno-optimize-sibling-calls -fstack-protector -DZEND_COMPILE_DL_EXT=1 -c /tmp/ptester-1001/thread/3/8.3dev-zts/tmp-xdebug/xdebug.c -MMD -MF xdebug.dep -MT xdebug.lo -fPIC -DPIC -o .libs/xdebug.o
cc -I. -I/tmp/ptester-1001/thread/3/8.3dev-zts/tmp-xdebug -I/tmp/ptester-1001/thread/3/8.3dev-zts/tmp-xdebug/include -I/tmp/ptester-1001/thread/3/8.3dev-zts/tmp-xdebug/main -I/tmp/ptester-1001/thread/3/8.3dev-zts/tmp-xdebug -I/tmp/php-build/workspace/install/8.3dev-zts/include/php -I/tmp/php-build/workspace/install/8.3dev-zts/include/php/main -I/tmp/php-build/workspace/install/8.3dev-zts/include/php/TSRM -I/tmp/php-build/workspace/install/8.3dev-zts/include/php/Zend -I/tmp/php-build/workspace/install/8.3dev-zts/include/php/ext -I/tmp/php-build/workspace/install/8.3dev-zts/include/php/ext/date/lib -I/tmp/ptester-1001/thread/3/8.3dev-zts/tmp-xdebug/src -DHAVE_CONFIG_H -g -O0 -D_GNU_SOURCE -g -O0 -Wall -Wdeclaration-after-statement -Wdiscarded-qualifiers -Wempty-body -Wenum-compare -Werror -Wextra -Wformat-nonliteral -Wformat-security -Wheader-guard -Wimplicit-fallthrough -Winit-self -Wlogical-not-parentheses -Wlogical-op -Wmaybe-uninitialized -Wmissing-format-attribute -Wno-missing-field-initializers -Wno-sign-compare -Wno-unused-but-set-variable -Wno-unused-parameter -Wno-variadic-macros -Wparentheses -Wsizeof-array-argument -Wwrite-strings -Wpointer-arith -fdiagnostics-show-option -fno-exceptions -fno-omit-frame-pointer -fno-optimize-sibling-calls -fstack-protector -DZEND_COMPILE_DL_EXT=1 -c /tmp/ptester-1001/thread/3/8.3dev-zts/tmp-xdebug/src/lib/cmd_parser.c -MMD -MF src/lib/cmd_parser.dep -MT src/lib/cmd_parser.lo -fPIC -DPIC -o src/lib/.libs/cmd_parser.o
cc -I. -I/tmp/ptester-1001/thread/3/8.3dev-zts/tmp-xdebug -I/tmp/ptester-1001/thread/3/8.3dev-zts/tmp-xdebug/include -I/tmp/ptester-1001/thread/3/8.3dev-zts/tmp-xdebug/main -I/tmp/ptester-1001/thread/3/8.3dev-zts/tmp-xdebug -I/tmp/php-build/workspace/install/8.3dev-zts/include/php -I/tmp/php-build/workspace/install/8.3dev-zts/include/php/main -I/tmp/php-build/workspace/install/8.3dev-zts/include/php/TSRM -I/tmp/php-build/workspace/install/8.3dev-zts/include/php/Zend -I/tmp/php-build/workspace/install/8.3dev-zts/include/php/ext -I/tmp/php-build/workspace/install/8.3dev-zts/include/php/ext/date/lib -I/tmp/ptester-1001/thread/3/8.3dev-zts/tmp-xdebug/src -DHAVE_CONFIG_H -g -O0 -D_GNU_SOURCE -g -O0 -Wall -Wdeclaration-after-statement -Wdiscarded-qualifiers -Wempty-body -Wenum-compare -Werror -Wextra -Wformat-nonliteral -Wformat-security -Wheader-guard -Wimplicit-fallthrough -Winit-self -Wlogical-not-parentheses -Wlogical-op -Wmaybe-uninitialized -Wmissing-format-attribute -Wno-missing-field-initializers -Wno-sign-compare -Wno-unused-but-set-variable -Wno-unused-parameter -Wno-variadic-macros -Wparentheses -Wsizeof-array-argument -Wwrite-strings -Wpointer-arith -fdiagnostics-show-option -fno-exceptions -fno-omit-frame-pointer -fno-optimize-sibling-calls -fstack-protector -DZEND_COMPILE_DL_EXT=1 -c /tmp/ptester-1001/thread/3/8.3dev-zts/tmp-xdebug/src/lib/log.c -MMD -MF src/lib/log.dep -MT src/lib/log.lo -fPIC -DPIC -o src/lib/.libs/log.o
cc -I. -I/tmp/ptester-1001/thread/3/8.3dev-zts/tmp-xdebug -I/tmp/ptester-1001/thread/3/8.3dev-zts/tmp-xdebug/include -I/tmp/ptester-1001/thread/3/8.3dev-zts/tmp-xdebug/main -I/tmp/ptester-1001/thread/3/8.3dev-zts/tmp-xdebug -I/tmp/php-build/workspace/install/8.3dev-zts/include/php -I/tmp/php-build/workspace/install/8.3dev-zts/include/php/main -I/tmp/php-build/workspace/install/8.3dev-zts/include/php/TSRM -I/tmp/php-build/workspace/install/8.3dev-zts/include/php/Zend -I/tmp/php-build/workspace/install/8.3dev-zts/include/php/ext -I/tmp/php-build/workspace/install/8.3dev-zts/include/php/ext/date/lib -I/tmp/ptester-1001/thread/3/8.3dev-zts/tmp-xdebug/src -DHAVE_CONFIG_H -g -O0 -D_GNU_SOURCE -g -O0 -Wall -Wdeclaration-after-statement -Wdiscarded-qualifiers -Wempty-body -Wenum-compare -Werror -Wextra -Wformat-nonliteral -Wformat-security -Wheader-guard -Wimplicit-fallthrough -Winit-self -Wlogical-not-parentheses -Wlogical-op -Wmaybe-uninitialized -Wmissing-format-attribute -Wno-missing-field-initializers -Wno-sign-compare -Wno-unused-but-set-variable -Wno-unused-parameter -Wno-variadic-macros -Wparentheses -Wsizeof-array-argument -Wwrite-strings -Wpointer-arith -fdiagnostics-show-option -fno-exceptions -fno-omit-frame-pointer -fno-optimize-sibling-calls -fstack-protector -DZEND_COMPILE_DL_EXT=1 -c /tmp/ptester-1001/thread/3/8.3dev-zts/tmp-xdebug/src/base/filter.c -MMD -MF src/base/filter.dep -MT src/base/filter.lo -fPIC -DPIC -o src/base/.libs/filter.o
cc -I. -I/tmp/ptester-1001/thread/3/8.3dev-zts/tmp-xdebug -I/tmp/ptester-1001/thread/3/8.3dev-zts/tmp-xdebug/include -I/tmp/ptester-1001/thread/3/8.3dev-zts/tmp-xdebug/main -I/tmp/ptester-1001/thread/3/8.3dev-zts/tmp-xdebug -I/tmp/php-build/workspace/install/8.3dev-zts/include/php -I/tmp/php-build/workspace/install/8.3dev-zts/include/php/main -I/tmp/php-build/workspace/install/8.3dev-zts/include/php/TSRM -I/tmp/php-build/workspace/install/8.3dev-zts/include/php/Zend -I/tmp/php-build/workspace/install/8.3dev-zts/include/php/ext -I/tmp/php-build/workspace/install/8.3dev-zts/include/php/ext/date/lib -I/tmp/ptester-1001/thread/3/8.3dev-zts/tmp-xdebug/src -DHAVE_CONFIG_H -g -O0 -D_GNU_SOURCE -g -O0 -Wall -Wdeclaration-after-statement -Wdiscarded-qualifiers -Wempty-body -Wenum-compare -Werror -Wextra -Wformat-nonliteral -Wformat-security -Wheader-guard -Wimplicit-fallthrough -Winit-self -Wlogical-not-parentheses -Wlogical-op -Wmaybe-uninitialized -Wmissing-format-attribute -Wno-missing-field-initializers -Wno-sign-compare -Wno-unused-but-set-variable -Wno-unused-parameter -Wno-variadic-macros -Wparentheses -Wsizeof-array-argument -Wwrite-strings -Wpointer-arith -fdiagnostics-show-option -fno-exceptions -fno-omit-frame-pointer -fno-optimize-sibling-calls -fstack-protector -DZEND_COMPILE_DL_EXT=1 -c /tmp/ptester-1001/thread/3/8.3dev-zts/tmp-xdebug/src/lib/str.c -MMD -MF src/lib/str.dep -MT src/lib/str.lo -fPIC -DPIC -o src/lib/.libs/str.o
/tmp/ptester-1001/thread/3/8.3dev-zts/tmp-xdebug/src/lib/lib.c: In function ‘xdebug_lib_set_mode_from_setting’:
/tmp/ptester-1001/thread/3/8.3dev-zts/tmp-xdebug/src/lib/lib.c:197:15: error: assignment discards ‘const’ qualifier from pointer target type [-Werror=discarded-qualifiers]
197 | comma = strchr(mode_ptr, ',');
| ^
/tmp/ptester-1001/thread/3/8.3dev-zts/tmp-xdebug/src/lib/lib.c:204:23: error: assignment discards ‘const’ qualifier from pointer target type [-Werror=discarded-qualifiers]
204 | comma = strchr(mode_ptr, ',');
| ^
cc1: all warnings being treated as errors
make: *** [Makefile:305: src/lib/lib.lo] Error 1
cc -I. -I/tmp/ptester-1001/thread/3/8.3dev-zts/tmp-xdebug -I/tmp/ptester-1001/thread/3/8.3dev-zts/tmp-xdebug/include -I/tmp/ptester-1001/thread/3/8.3dev-zts/tmp-xdebug/main -I/tmp/ptester-1001/thread/3/8.3dev-zts/tmp-xdebug -I/tmp/php-build/workspace/install/8.3dev-zts/include/php -I/tmp/php-build/workspace/install/8.3dev-zts/include/php/main -I/tmp/php-build/workspace/install/8.3dev-zts/include/php/TSRM -I/tmp/php-build/workspace/install/8.3dev-zts/include/php/Zend -I/tmp/php-build/workspace/install/8.3dev-zts/include/php/ext -I/tmp/php-build/workspace/install/8.3dev-zts/include/php/ext/date/lib -I/tmp/ptester-1001/thread/3/8.3dev-zts/tmp-xdebug/src -DHAVE_CONFIG_H -g -O0 -D_GNU_SOURCE -g -O0 -Wall -Wdeclaration-after-statement -Wdiscarded-qualifiers -Wempty-body -Wenum-compare -Werror -Wextra -Wformat-nonliteral -Wformat-security -Wheader-guard -Wimplicit-fallthrough -Winit-self -Wlogical-not-parentheses -Wlogical-op -Wmaybe-uninitialized -Wmissing-format-attribute -Wno-missing-field-initializers -Wno-sign-compare -Wno-unused-but-set-variable -Wno-unused-parameter -Wno-variadic-macros -Wparentheses -Wsizeof-array-argument -Wwrite-strings -Wpointer-arith -fdiagnostics-show-option -fno-exceptions -fno-omit-frame-pointer -fno-optimize-sibling-calls -fstack-protector -DZEND_COMPILE_DL_EXT=1 -c /tmp/ptester-1001/thread/3/8.3dev-zts/tmp-xdebug/src/lib/trim.c -MMD -MF src/lib/trim.dep -MT src/lib/trim.lo -fPIC -DPIC -o src/lib/.libs/trim.o
cc -I. -I/tmp/ptester-1001/thread/3/8.3dev-zts/tmp-xdebug -I/tmp/ptester-1001/thread/3/8.3dev-zts/tmp-xdebug/include -I/tmp/ptester-1001/thread/3/8.3dev-zts/tmp-xdebug/main -I/tmp/ptester-1001/thread/3/8.3dev-zts/tmp-xdebug -I/tmp/php-build/workspace/install/8.3dev-zts/include/php -I/tmp/php-build/workspace/install/8.3dev-zts/include/php/main -I/tmp/php-build/workspace/install/8.3dev-zts/include/php/TSRM -I/tmp/php-build/workspace/install/8.3dev-zts/include/php/Zend -I/tmp/php-build/workspace/install/8.3dev-zts/include/php/ext -I/tmp/php-build/workspace/install/8.3dev-zts/include/php/ext/date/lib -I/tmp/ptester-1001/thread/3/8.3dev-zts/tmp-xdebug/src -DHAVE_CONFIG_H -g -O0 -D_GNU_SOURCE -g -O0 -Wall -Wdeclaration-after-statement -Wdiscarded-qualifiers -Wempty-body -Wenum-compare -Werror -Wextra -Wformat-nonliteral -Wformat-security -Wheader-guard -Wimplicit-fallthrough -Winit-self -Wlogical-not-parentheses -Wlogical-op -Wmaybe-uninitialized -Wmissing-format-attribute -Wno-missing-field-initializers -Wno-sign-compare -Wno-unused-but-set-variable -Wno-unused-parameter -Wno-variadic-macros -Wparentheses -Wsizeof-array-argument -Wwrite-strings -Wpointer-arith -fdiagnostics-show-option -fno-exceptions -fno-omit-frame-pointer -fno-optimize-sibling-calls -fstack-protector -DZEND_COMPILE_DL_EXT=1 -c /tmp/ptester-1001/thread/3/8.3dev-zts/tmp-xdebug/src/lib/var.c -MMD -MF src/lib/var.dep -MT src/lib/var.lo -fPIC -DPIC -o src/lib/.libs/var.o